Target
Sodium channel protein type 7 subunit alpha
Ligand
BDBM50004704
Substrate
Meas. Tech.
ChEMBL_1478675 (CHEMBL3430576)
IC50
9000±n/a nM
Citation
 Mirams, GRCui, YSher, AFink, MCooper, JHeath, BMMcMahon, NCGavaghan, DJNoble, D Simulation of multiple ion channel block provides improved early prediction of compounds' clinical torsadogenic risk. Cardiovasc Res 91:53-61 (2011)  
Target
Name:
Sodium channel protein type 7 subunit alpha
Synonyms:
Putative voltage-gated sodium channel subunit alpha Nax SCN7A Sodium channel protein cardiac and skeletal muscle subunit alpha Sodium channel protein type VII subunit alpha
Type:
PROTEIN
Mol. Mass.:
193514.99
Organism:
Homo sapiens (Human)
Description:
ChEMBL_105639
Residue:
1682
  
Inhibitor
Name:
BDBM50004704
Synonyms:
(+)-cis-Diltiazem 5-(2-dimethylamino-ethyl)-2-(4-methoxy-phenyl)-4-oxo-2,3,4,5-tetrahydro-benzo[b][1,4]thiazepin-3-yl ester(Diltiazem)Acetic acid Acetic acid (2S,3S)-5-(2-dimethylamino-ethyl)-2-(4-methoxy-phenyl)-4-oxo-2,3,4,5-tetrahydro-benzo[b][1,4]thiazepin-3-yl ester Acetic acid 5-(2-dimethylamino-ethyl)-2-(4-methoxy-phenyl)-4-oxo-2,3,4,5-tetrahydro-benzo[b][1,4]thiazepin-3-yl ester Acetic acid 5-(2-dimethylamino-ethyl)-2-(4-methoxy-phenyl)-4-oxo-2,3,4,5-tetrahydro-benzo[b][1,4]thiazepin-3-yl ester(cis-(+)-Diltiazem) CHEMBL23 DILTIAZEM Diltzac Tiamate cis-Acetic acid 5-(2-dimethylamino-ethyl)-2-(4-methoxy-phenyl)-4-oxo-2,3,4,5-tetrahydro-benzo[b][1,4]thiazepin-3-yl ester | diltiazem;Acetic acid 5-(2-dimethylamino-ethyl)-2-(4-methoxy-phenyl)-4-oxo-2,3,4,5-tetrahydro-benzo[b][1,4]thiazepin-3-yl ester
Type:
Small organic molecule
Emp. Form.:
C22H26N2O4S
Mol. Mass.:
414.518
SMILES:
COc1ccc(cc1)[C@@H]1Sc2ccccc2N(CCN(C)C)C(=O)[C@@H]1OC(C)=O
: