Target
Voltage-dependent L-type calcium channel subunit alpha-1C
Ligand
BDBM50015214
Substrate
Meas. Tech.
ChEMBL_1479119 (CHEMBL3436095)
IC50
5200±n/a nM
Citation
 Wisniowska, BMendyk, AFijorek, KGlinka, APolak, S Predictive model for L-type channel inhibition: multichannel block in QT prolongation risk assessment. J Appl Toxicol 32:858-66 (2012)  
Target
Name:
Voltage-dependent L-type calcium channel subunit alpha-1C
Synonyms:
CAC1C_RAT Cacn2 Cacnl1a1 Calcium channel (Type L) Calcium channel, L type, alpha-1 polypeptide, isoform 1, cardiac muscle RBC Voltage-dependent L-type calcium channel subunit alpha-1C Voltage-gated L-type calcium channel alpha-1C subunit | Voltage-gated calcium channel subunit alpha Cav1.2
Type:
Enzyme Catalytic Domain
Mol. Mass.:
243492.26
Organism:
RAT
Description:
Calcium channel 0 RAT::P22002
Residue:
2169
  
Inhibitor
Name:
BDBM50015214
Synonyms:
6-chloro-2-methoxy-9-acridinyl(4-diethylamino-1-methylbutyl)amine CHEMBL7568 N*4*-(6-Chloro-2-methoxy-acridin-9-yl)-N*1*,N*1*-diethyl-pentane-1,4-diamine N*4*-(6-Chloro-2-methoxy-acridin-9-yl)-N*1*,N*1*-diethyl-pentane-1,4-diamine ; (mepacrine) cid_237 | quinacrine
Type:
Small organic molecule
Emp. Form.:
C23H30ClN3O
Mol. Mass.:
399.957
SMILES:
CCN(CC)CCCC(C)Nc1c2ccc(Cl)cc2nc2ccc(OC)cc12
: