Target
Voltage-dependent L-type calcium channel subunit alpha-1C
Ligand
BDBM50017376
Substrate
Meas. Tech.
ChEMBL_1479162 (CHEMBL3436138)
IC50
250±n/a nM
Citation
 Wisniowska, BMendyk, AFijorek, KGlinka, APolak, S Predictive model for L-type channel inhibition: multichannel block in QT prolongation risk assessment. J Appl Toxicol 32:858-66 (2012)  
Target
Name:
Voltage-dependent L-type calcium channel subunit alpha-1C
Synonyms:
CAC1C_CAVPO CACH2 CACNA1C CCHL1A1 Voltage-dependent L-type calcium channel subunit alpha-1C | Voltage-gated calcium channel subunit alpha Cav1.2
Type:
PROTEIN
Mol. Mass.:
19518.62
Organism:
Cavia porcellus
Description:
ChEMBL_106600
Residue:
169
  
Inhibitor
Name:
BDBM50017376
Synonyms:
(+/-)1-(4-tert-butylphenyl)-4-(4-(hydroxydiphenylmethyl)piperidin-1-yl)butan-1-ol 1-(4-tert-Butyl-phenyl)-4-[4-(hydroxy-diphenyl-methyl)-piperidin-1-yl]-butan-1-ol(Terfenadine) CHEMBL17157 teraenadine
Type:
Small organic molecule
Emp. Form.:
C32H41NO2
Mol. Mass.:
471.6734
SMILES:
CC(C)(C)c1ccc(cc1)C(O)CCCN1CCC(CC1)C(O)(c1ccccc1)c1ccccc1
: