Target
Bile salt export pump
Ligand
BDBM50003659
Substrate
Meas. Tech.
ChEMBL_1481883 (CHEMBL3540574)
IC50
>1000000±n/a nM
Citation
 Dawson, SStahl, SPaul, NBarber, JKenna, JG In vitro inhibition of the bile salt export pump correlates with risk of cholestatic drug-induced liver injury in humans. Drug Metab Dispos 40:130-8 (2011)  
Target
Name:
Bile salt export pump
Synonyms:
ABCBB_RAT Abcb11 Bile salt export pump Sister of P-glycoprotein | Spgp
Type:
PROTEIN
Mol. Mass.:
146267.86
Organism:
Rattus norvegicus
Description:
ChEMBL_1481883
Residue:
1321
  
Inhibitor
Name:
BDBM50003659
Synonyms:
5H-dibenzo[b,f]azepine-5-carboxamide CARBATROL DIBENZO[B,F]AZEPINE-5-CARBOXYLIC ACID AMIDE(CARBAMAZEPINE) EQUETRO TEGRETOL TERIL US9144538, Carbamazepine
Type:
Small organic molecule
Emp. Form.:
C15H12N2O
Mol. Mass.:
236.2686
SMILES:
NC(=O)N1c2ccccc2C=Cc2ccccc12
: