Target
Bile salt export pump
Ligand
BDBM50029764
Substrate
Meas. Tech.
ChEMBL_1481883 (CHEMBL3540574)
IC50
>1000000±n/a nM
Citation
 Dawson, SStahl, SPaul, NBarber, JKenna, JG In vitro inhibition of the bile salt export pump correlates with risk of cholestatic drug-induced liver injury in humans. Drug Metab Dispos 40:130-8 (2011)  
Target
Name:
Bile salt export pump
Synonyms:
ABCBB_RAT Abcb11 Bile salt export pump Sister of P-glycoprotein | Spgp
Type:
PROTEIN
Mol. Mass.:
146267.86
Organism:
Rattus norvegicus
Description:
ChEMBL_1481883
Residue:
1321
  
Inhibitor
Name:
BDBM50029764
Synonyms:
1,1'-sulfonylbis(4-aminobenzene) 4,4'-dapsone 4,4'-sulfonylbisaniline 4-aminophenyl sulfone CHEMBL1043 DAPSONE Diaphenylsulfone p,p-sulphonylbisbenzamine p-aminophenyl sulfone
Type:
Small organic molecule
Emp. Form.:
C12H12N2O2S
Mol. Mass.:
248.301
SMILES:
Nc1ccc(cc1)S(=O)(=O)c1ccc(N)cc1
: