Target
Bile salt export pump
Ligand
BDBM50241361
Substrate
Meas. Tech.
ChEMBL_1481883 (CHEMBL3540574)
IC50
>1000000±n/a nM
Citation
 Dawson, SStahl, SPaul, NBarber, JKenna, JG In vitro inhibition of the bile salt export pump correlates with risk of cholestatic drug-induced liver injury in humans. Drug Metab Dispos 40:130-8 (2011)  
Target
Name:
Bile salt export pump
Synonyms:
ABCBB_RAT Abcb11 Bile salt export pump Sister of P-glycoprotein | Spgp
Type:
PROTEIN
Mol. Mass.:
146267.86
Organism:
Rattus norvegicus
Description:
ChEMBL_1481883
Residue:
1321
  
Inhibitor
Name:
BDBM50241361
Synonyms:
CHEMBL1515 US9138393, Methimazole | US9144538, Methimazole
Type:
Small organic molecule
Emp. Form.:
C4H6N2S
Mol. Mass.:
114.169
SMILES:
Cn1cc[nH]c1=S
: