Target
Bile salt export pump
Ligand
BDBM50088494
Substrate
Meas. Tech.
ChEMBL_1481882 (CHEMBL3540573)
IC50
2700±n/a nM
Citation
 Dawson, SStahl, SPaul, NBarber, JKenna, JG In vitro inhibition of the bile salt export pump correlates with risk of cholestatic drug-induced liver injury in humans. Drug Metab Dispos 40:130-8 (2011)  
Target
Name:
Bile salt export pump
Synonyms:
ABCB11 ATP-binding cassette sub-family B member 11 Bile Salt Export Pump, BSEP Bile salt export pump (BSEP)
Type:
Protein
Mol. Mass.:
146405.49
Organism:
Homo sapiens (Human)
Description:
O95342
Residue:
1321
  
Inhibitor
Name:
BDBM50088494
Synonyms:
BDBM50101974 CI-991 GR-92132X Prelay TROGLITAZONE
Type:
Small organic molecule
Emp. Form.:
C24H27NO5S
Mol. Mass.:
441.54
SMILES:
Cc1c(C)c2OC(C)(COc3ccc(CC4SC(=O)NC4=O)cc3)CCc2c(C)c1O
: