Target
Bile salt export pump
Ligand
BDBM50108877
Substrate
Meas. Tech.
ChEMBL_1481883 (CHEMBL3540574)
IC50
47200±n/a nM
Citation
 Dawson, SStahl, SPaul, NBarber, JKenna, JG In vitro inhibition of the bile salt export pump correlates with risk of cholestatic drug-induced liver injury in humans. Drug Metab Dispos 40:130-8 (2011)  
Target
Name:
Bile salt export pump
Synonyms:
ABCBB_RAT Abcb11 Bile salt export pump Sister of P-glycoprotein | Spgp
Type:
PROTEIN
Mol. Mass.:
146267.86
Organism:
Rattus norvegicus
Description:
ChEMBL_1481883
Residue:
1321
  
Inhibitor
Name:
BDBM50108877
Synonyms:
(3,4-Dihydroxy-5-nitro-phenyl)-p-tolyl-methanone CHEMBL1324 TOLCAPONE Tasmar
Type:
Small organic molecule
Emp. Form.:
C14H11NO5
Mol. Mass.:
273.2408
SMILES:
Cc1ccc(cc1)C(=O)c1cc(O)c(O)c(c1)[N+]([O-])=O
: