Target
Aldehyde oxidase
Ligand
BDBM17292
Substrate
Meas. Tech.
ChEMBL_1481152 (CHEMBL3537682)
Ki
4400±n/a nM
Citation
 Barr, JTJones, JP Evidence for substrate-dependent inhibition profiles for human liver aldehyde oxidase. Drug Metab Dispos 41:24-9 (2012)  
Target
Name:
Aldehyde oxidase
Synonyms:
AO AOXA_HUMAN | Aldehyde oxidase
Type:
PROTEIN
Mol. Mass.:
147930.97
Organism:
Homo sapiens (Human)
Description:
ChEMBL_1481150
Residue:
1338
  
Inhibitor
Name:
BDBM17292
Synonyms:
(1S,10R,11S,14S,15S)-15-methyltetracyclo[8.7.0.0^{2,7}.0^{11,15}]heptadeca-2,4,6-triene-5,14-diol 17α-ethinylestradiol CHEMBL135 ESTRADIOL Ovocyclin US9040509, E2 US9561238, E2 [2,4,6,7-3H]-E2 [3H]]estradiol
Type:
Steroid
Emp. Form.:
C18H24O2
Mol. Mass.:
272.382
SMILES:
[H][C@@]12CC[C@H](O)[C@@]1(C)CC[C@]1([H])c3ccc(O)cc3CC[C@@]21[H]
: