Target
Glycogen phosphorylase, liver form
Ligand
BDBM50016703
Substrate
Meas. Tech.
ChEMBL_1491377 (CHEMBL3532881)
IC50
1100±n/a nM
Citation
 Honda, TKaneno-Urasaki, YMurai, TKakuta, MNasu, HNamba, EKoga, TOkuno, AIzumi, T Absorption, elimination, and metabolism of CS-1036, a novela-amylase inhibitor in rats and monkeys, and the relationship between gastrointestinal distribution and suppression of glucose absorption. Drug Metab Dispos 41:878-87 (2013)  
Target
Name:
Glycogen phosphorylase, liver form
Synonyms:
Glycogen phosphorylase, liver form Liver glycogen phosphorylase Pygl
Type:
PROTEIN
Mol. Mass.:
97489.46
Organism:
Rattus norvegicus
Description:
ChEMBL_1491377
Residue:
850
  
Inhibitor
Name:
BDBM50016703
Synonyms:
2-Hydroxymethyl-pyrrolidine-3,4-diol CHEMBL80254 | Imino-D-Arabinitol
Type:
Small organic molecule
Emp. Form.:
C5H11NO3
Mol. Mass.:
133.1457
SMILES:
OC[C@H]1NC[C@@H](O)[C@@H]1O
: