Target
Nuclear receptor subfamily 1 group I member 2
Ligand
BDBM50103635
Substrate
Meas. Tech.
ChEMBL_1487568 (CHEMBL3531874)
EC50
2800±n/a nM
Citation
 Shukla, SJSakamuru, SHuang, RMoeller, TAShinn, PVanleer, DAuld, DSAustin, CPXia, M Identification of clinically used drugs that activate pregnane X receptors. Drug Metab Dispos 39:151-9 (2010)  
Target
Name:
Nuclear receptor subfamily 1 group I member 2
Synonyms:
NR1I2_RAT Nuclear receptor subfamily 1 group I member 2 Pregnane X receptor | Pxr
Type:
PROTEIN
Mol. Mass.:
49664.53
Organism:
Rattus norvegicus
Description:
ChEMBL_105143
Residue:
431
  
Inhibitor
Name:
BDBM50103635
Synonyms:
CHEBI:31359 | Carminomycin
Type:
Small organic molecule
Emp. Form.:
C26H27NO10
Mol. Mass.:
513.4933
SMILES:
[H][C@@]1(C[C@@](O)(Cc2c(O)c3C(=O)c4cccc(O)c4C(=O)c3c(O)c12)C(C)=O)O[C@H]1C[C@H](N)[C@H](O)[C@H](C)O1
: