Target
Nuclear receptor subfamily 1 group I member 2
Ligand
BDBM50375318
Substrate
Meas. Tech.
ChEMBL_1487568 (CHEMBL3531874)
EC50
9100±n/a nM
Citation
 Shukla, SJSakamuru, SHuang, RMoeller, TAShinn, PVanleer, DAuld, DSAustin, CPXia, M Identification of clinically used drugs that activate pregnane X receptors. Drug Metab Dispos 39:151-9 (2010)  
Target
Name:
Nuclear receptor subfamily 1 group I member 2
Synonyms:
NR1I2_RAT Nuclear receptor subfamily 1 group I member 2 Pregnane X receptor | Pxr
Type:
PROTEIN
Mol. Mass.:
49664.53
Organism:
Rattus norvegicus
Description:
ChEMBL_105143
Residue:
431
  
Inhibitor
Name:
BDBM50375318
Synonyms:
Fungistat Panlomyc TERCONAZOLE Terazol 3 med.21724, Compound Terconazole
Type:
Small organic molecule
Emp. Form.:
C26H31Cl2N5O3
Mol. Mass.:
532.462
SMILES:
CC(C)N1CCN(CC1)c1ccc(OC[C@H]2CO[C@@](Cn3cncn3)(O2)c2ccc(Cl)cc2Cl)cc1
: