Target
Cytochrome P450 3A4
Ligand
BDBM50211114
Substrate
Meas. Tech.
ChEMBL_1491685 (CHEMBL3536518)
IC50
30000±n/a nM
Citation
 Henne, KRTran, TBVandenBrink, BMRock, DAAidasani, DKSubramanian, RMason, AKStresser, DMTeffera, YWong, SGJohnson, MGChen, XTonn, GRWong, BK Sequential metabolism of AMG 487, a novel CXCR3 antagonist, results in formation of quinone reactive metabolites that covalently modify CYP3A4 Cys239 and cause time-dependent inhibition of the enzyme. Drug Metab Dispos 40:1429-40 (2012)  
Target
Name:
Cytochrome P450 3A4
Synonyms:
Albendazole monooxygenase CP3A4_HUMAN CYP3A4 CYPIIIA4 Cytochrome P450 3A4 (CYP3A4) Nifedipine oxidase Taurochenodeoxycholate 6-alpha-hydroxylase
Type:
Enzyme
Mol. Mass.:
57349.57
Organism:
Homo sapiens (Human)
Description:
Residue:
503
  
Inhibitor
Name:
BDBM50211114
Synonyms:
(-)-(R)-N-(1-(3-(4-ethoxyphenyl)-4-oxo-3,4-dihydropyrido[2,3-d]pyrimidin-2-yl)ethyl)-N-(pyridin-3-ylmethyl)-2-(4-(trifluoromethoxy)phenyl)acetamide AMG-487 | CHEMBL397983
Type:
Small organic molecule
Emp. Form.:
C32H28F3N5O4
Mol. Mass.:
603.591
SMILES:
CCOc1ccc(cc1)-n1c(nc2ncccc2c1=O)[C@@H](C)N(Cc1cccnc1)C(=O)Cc1ccc(OC(F)(F)F)cc1
: