Target
Cytochrome P450 2D6
Ligand
BDBM50418100
Substrate
Meas. Tech.
ChEMBL_1486293 (CHEMBL3535063)
Ki
550±n/a nM
Citation
 Nagy, LDMocny, CSDiffenderfer, LEHsi, DJButler, BFArthur, EJFletke, KJPalamanda, JRNomeir, AAFurge, LL Substituted imidazole of 5-fluoro-2-[4-[(2-phenyl-1H-imidazol-5-yl)methyl]-1-piperazinyl]pyrimidine Inactivates cytochrome P450 2D6 by protein adduction. Drug Metab Dispos 39:974-83 (2011)  
Target
Name:
Cytochrome P450 2D6
Synonyms:
CP2D6_HUMAN CYP2DL1 Cytochrome P450 2D6 (CYP2D6) P450-DB1
Type:
Protein
Mol. Mass.:
55774.82
Organism:
Homo sapiens (Human)
Description:
P10635
Residue:
497
  
Inhibitor
Name:
BDBM50418100
Synonyms:
CHEMBL1743355 | SCH-66712
Type:
Small organic molecule
Emp. Form.:
C18H19FN6
Mol. Mass.:
338.3821
SMILES:
Fc1cnc(nc1)N1CCN(Cc2cnc([nH]2)-c2ccccc2)CC1
: