Target
Cytochrome P450 2C9
Ligand
BDBM58922
Substrate
Meas. Tech.
ChEMBL_1486373 (CHEMBL3536201)
Ki
7400±n/a nM
Citation
 Filppula, AMLaitila, JNeuvonen, PJBackman, JT Reevaluation of the microsomal metabolism of montelukast: major contribution by CYP2C8 at clinically relevant concentrations. Drug Metab Dispos 39:904-11 (2011)  
Target
Name:
Cytochrome P450 2C9
Synonyms:
(R)-limonene 6-monooxygenase CP2C9_HUMAN CYP2C9 Cytochrome P450 2C9 (CYP2C9 ) P-450MP P450 PB-1 | S-mephenytoin 4-hydroxylase
Type:
Enzyme
Mol. Mass.:
55636.33
Organism:
Homo sapiens (Human)
Description:
P11712
Residue:
490
  
Inhibitor
Name:
BDBM58922
Synonyms:
MLS001304727 SMR000469188 sodium;2-[1-[[(1R)-1-[3-[(E)-2-(7-chloranylquinolin-2-yl)ethenyl]phenyl]-3-[2-(2-oxidanylpropan-2-yl)phenyl]propyl]sulfanylmethyl]cyclopropyl]ethanoate sodium;2-[1-[[[(1R)-1-[3-[(E)-2-(7-chloro-2-quinolinyl)ethenyl]phenyl]-3-[2-(2-hydroxypropan-2-yl)phenyl]propyl]thio]methyl]cyclopropyl]acetate | sodium;2-[1-[[[(1R)-1-[3-[(E)-2-(7-chloro-2-quinolyl)vinyl]phenyl]-3-[2-(1-hydroxy-1-methyl-ethyl)phenyl]propyl]thio]methyl]cyclopropyl]acetate
Type:
Small organic molecule
Emp. Form.:
C35H35ClNO3S
Mol. Mass.:
585.176
SMILES:
CC(C)(O)c1ccccc1CC[C@@H](SCC1(CC([O-])=O)CC1)c1cccc(\C=C\c2ccc3ccc(Cl)cc3n2)c1
: