Target
UDP-glucuronosyltransferase 1A1
Ligand
BDBM30705
Substrate
Meas. Tech.
ChEMBL_1486476 (CHEMBL3531466)
IC50
160000±n/a nM
Citation
 Zhou, JTracy, TSRemmel, RP Correlation between bilirubin glucuronidation and estradiol-3-gluronidation in the presence of model UDP-glucuronosyltransferase 1A1 substrates/inhibitors. Drug Metab Dispos 39:322-9 (2011)  
Target
Name:
UDP-glucuronosyltransferase 1A1
Synonyms:
Bilirubin-specific UDPGT isozyme 1 UD11_HUMAN UDP-glucuronosyltransferase 1-A UDPGT 1-1 UGT1 UGT1-01 UGT1A Uridine-5'-diphosphoglucuronosyltransferase 1A1 | hUG-BR1
Type:
Enzyme
Mol. Mass.:
59604.34
Organism:
Homo sapiens (Human)
Description:
P22309
Residue:
533
  
Inhibitor
Name:
BDBM30705
Synonyms:
CHEMBL744 RILUZOLE cid_5070
Type:
Small organic molecule
Emp. Form.:
C8H5F3N2OS
Mol. Mass.:
234.198
SMILES:
Nc1nc2ccc(OC(F)(F)F)cc2s1
: