Target
Equilibrative nucleoside transporter 2
Ligand
BDBM50138530
Substrate
Meas. Tech.
ChEMBL_1494514 (CHEMBL3528991)
Ki
189000±n/a nM
Citation
 Lepist, EIDamaraju, VLZhang, JGati, WPYao, SYSmith, KMKarpinski, EYoung, JDLeung, KHCass, CE Transport of A1 adenosine receptor agonist tecadenoson by human and mouse nucleoside transporters: evidence for blood-brain barrier transport by murine equilibrative nucleoside transporter 1 mENT1. Drug Metab Dispos 41:916-22 (2013)  
Target
Name:
Equilibrative nucleoside transporter 2
Synonyms:
36 kDa nucleolar protein HNP36 DER12 ENT2 Equilibrative nitrobenzylmercaptopurine riboside-insensitive nucleoside transporter HNP36 Nucleoside transporter, ei-type SLC29A2 | Solute carrier family 29 member 2
Type:
PROTEIN
Mol. Mass.:
50110.91
Organism:
Homo sapiens (Human)
Description:
ChEMBL_109695
Residue:
456
  
Inhibitor
Name:
BDBM50138530
Synonyms:
(2R,3R,5R)-2-Hydroxymethyl-5-{6-[(R)-(tetrahydro-furan-3-yl)amino]-purin-9-yl}-tetrahydro-furan-3,4-diol BDBM50224766 CVT-510 | Tecadenoson
Type:
Small organic molecule
Emp. Form.:
C14H19N5O5
Mol. Mass.:
337.3312
SMILES:
OC[C@H]1O[C@H]([C@H](O)[C@@H]1O)n1cnc2c(N[C@@H]3CCOC3)ncnc12
: