Target
UDP-glucuronosyltransferase 2B7
Ligand
BDBM19264
Substrate
Meas. Tech.
ChEMBL_1492938 (CHEMBL3528662)
Ki
2000±n/a nM
Citation
 Dostalek, MCourt, MHHazarika, SAkhlaghi, F Diabetes mellitus reduces activity of human UDP-glucuronosyltransferase 2B7 in liver and kidney leading to decreased formation of mycophenolic acid acyl-glucuronide metabolite. Drug Metab Dispos 39:448-55 (2011)  
Target
Name:
UDP-glucuronosyltransferase 2B7
Synonyms:
2.4.1.17 UD2B7_HUMAN UDP-glucuronosyltransferase 2B9 UDPGT 2B9 UGT2B7 Uridine-5'-diphosphoglucuronosyltransferase 2B7
Type:
Enzyme
Mol. Mass.:
60705.98
Organism:
Homo sapiens (Human)
Description:
P16662
Residue:
529
  
Inhibitor
Name:
BDBM19264
Synonyms:
(4E)-6-(4-hydroxy-6-methoxy-7-methyl-3-oxo-1,3-dihydro-2-benzofuran-5-yl)-4-methylhex-4-enoic acid CHEMBL866 Mycophenolic Acid (MPA) | Myfortic
Type:
Small organic molecule
Emp. Form.:
C17H20O6
Mol. Mass.:
320.3371
SMILES:
COc1c(C)c2COC(=O)c2c(O)c1C\C=C(/C)CCC(O)=O
: