Target
Neutral amino acid transporter B(0)
Ligand
BDBM50088536
Substrate
Meas. Tech.
ChEMBL_1495669 (CHEMBL3578657)
IC50
664000±n/a nM
Citation
 Schulte, MLDawson, ESSaleh, SACuthbertson, MLManning, HC 2-Substituted N¿-glutamylanilides as novel probes of ASCT2 with improved potency. Bioorg Med Chem Lett 25:113-6 (2014)  
Target
Name:
Neutral amino acid transporter B(0)
Synonyms:
AAAT_HUMAN ASCT2 Baboon M7 virus receptor Neutral amino acid transporter B(0) RDR SLC1A5 Solute carrier family 1 member 5
Type:
PROTEIN
Mol. Mass.:
56592.12
Organism:
Homo sapiens (Human)
Description:
ChEMBL_109758
Residue:
541
  
Inhibitor
Name:
BDBM50088536
Synonyms:
CHEMBL3576927 | US10189805, Compound 3
Type:
Small organic molecule
Emp. Form.:
C15H21N3O4
Mol. Mass.:
307.3449
SMILES:
N[C@@H](CCC(=O)Nc1ccccc1N1CCOCC1)C(O)=O
: