Target
Acetylcholinesterase
Ligand
BDBM50088629
Substrate
Meas. Tech.
ChEMBL_1496997 (CHEMBL3579631)
IC50
1590±n/a nM
Citation
 Sang, ZQiang, XLi, YYuan, WLiu, QShi, YAng, WLuo, YTan, ZDeng, Y Design, synthesis and evaluation of scutellarein-O-alkylamines as multifunctional agents for the treatment of Alzheimer's disease. Eur J Med Chem 94:348-66 (2015)  
Target
Name:
Acetylcholinesterase
Synonyms:
ACES_RAT Acetylcholinesterase and butyrylcholinesterase (AChE and BChE) Acetylcholinesterase, AChE | Ache
Type:
Enzyme
Mol. Mass.:
68193.62
Organism:
Rattus norvegicus (rat)
Description:
P37136
Residue:
614
  
Inhibitor
Name:
BDBM50088629
Synonyms:
CHEMBL3577551
Type:
Small organic molecule
Emp. Form.:
C32H37NO7
Mol. Mass.:
547.6387
SMILES:
COc1ccccc1CN(C)CCCCCCOc1cccc(c1)-c1cc(=O)c2c(O)c(OC)c(OC)cc2o1
: