Target
Acetylcholinesterase
Ligand
BDBM50088783
Substrate
Meas. Tech.
ChEMBL_1496999 (CHEMBL3579633)
IC50
14400±n/a nM
Citation
 Sang, ZQiang, XLi, YYuan, WLiu, QShi, YAng, WLuo, YTan, ZDeng, Y Design, synthesis and evaluation of scutellarein-O-alkylamines as multifunctional agents for the treatment of Alzheimer's disease. Eur J Med Chem 94:348-66 (2015)  
Target
Name:
Acetylcholinesterase
Synonyms:
ACES_ELEEL Acetylcholinesterase (EeAChE) | ache
Type:
Enzyme
Mol. Mass.:
71812.79
Organism:
Electrophorus electricus (Electric eel)
Description:
Residue:
633
  
Inhibitor
Name:
BDBM50088783
Synonyms:
CHEMBL3577521
Type:
Small organic molecule
Emp. Form.:
C30H33NO7
Mol. Mass.:
519.5855
SMILES:
COc1ccccc1CN(C)CCCCOc1ccc(cc1)-c1cc(=O)c2c(O)c(OC)c(OC)cc2o1
: