Target
Acetylcholinesterase
Ligand
BDBM50088790
Substrate
Meas. Tech.
ChEMBL_1496997 (CHEMBL3579631)
IC50
1180±n/a nM
Citation
 Sang, ZQiang, XLi, YYuan, WLiu, QShi, YAng, WLuo, YTan, ZDeng, Y Design, synthesis and evaluation of scutellarein-O-alkylamines as multifunctional agents for the treatment of Alzheimer's disease. Eur J Med Chem 94:348-66 (2015)  
Target
Name:
Acetylcholinesterase
Synonyms:
ACES_RAT Acetylcholinesterase and butyrylcholinesterase (AChE and BChE) Acetylcholinesterase, AChE | Ache
Type:
Enzyme
Mol. Mass.:
68193.62
Organism:
Rattus norvegicus (rat)
Description:
P37136
Residue:
614
  
Inhibitor
Name:
BDBM50088790
Synonyms:
CHEMBL3577528
Type:
Small organic molecule
Emp. Form.:
C31H34N2O6
Mol. Mass.:
530.6115
SMILES:
COc1cc2oc(cc(=O)c2c(OC)c1OC)-c1cccc(OCCN2CCN(Cc3ccccc3)CC2)c1
: