Target
Mitogen-activated protein kinase 14
Ligand
BDBM50088856
Substrate
Meas. Tech.
ChEMBL_1497088 (CHEMBL3580221)
IC50
6.5±n/a nM
Citation
 Awadallah, FMAbou-Seri, SMAbdulla, MMGeorgey, HH Design and synthesis of potent 1,2,4-trisubstituted imidazolinone derivatives with dual p38aMAPK and ERK1/2 inhibitory activity. Eur J Med Chem 94:397-404 (2015)  
Target
Name:
Mitogen-activated protein kinase 14
Synonyms:
CSAID-binding protein CSBP1 CSPB1 MAP kinase 14 MAP kinase p38 alpha MAPK14 MK14_HUMAN Mitogen-activated protein kinase p38 alpha Stress-activated protein kinase 2a | p38 MAP kinase alpha/beta
Type:
Serine/threonine-protein kinase
Mol. Mass.:
41286.76
Organism:
Homo sapiens (Human)
Description:
Q16539
Residue:
360
  
Inhibitor
Name:
BDBM50088856
Synonyms:
CHEMBL3577631
Type:
Small organic molecule
Emp. Form.:
C32H27N3O5
Mol. Mass.:
533.5739
SMILES:
COc1cccc(NC(=O)COc2ccc(\C=C3/N=C(N(C3=O)c3cccc(OC)c3)c3ccccc3)cc2)c1
: