Target
Mitogen-activated protein kinase 1
Ligand
BDBM50089077
Substrate
Meas. Tech.
ChEMBL_1497090 (CHEMBL3580223)
IC50
21±n/a nM
Citation
 Awadallah, FMAbou-Seri, SMAbdulla, MMGeorgey, HH Design and synthesis of potent 1,2,4-trisubstituted imidazolinone derivatives with dual p38aMAPK and ERK1/2 inhibitory activity. Eur J Med Chem 94:397-404 (2015)  
Target
Name:
Mitogen-activated protein kinase 1
Synonyms:
ERK2 Extracellular signal-regulated kinase 2 Extracellular signal-regulated kinase 2 (ERK2) MAPK 2 MK01_HUMAN Mitogen-activated protein kinase 1 (ERK-2) Mitogen-activated protein kinase 2 PRKM2 | p42-MAPK
Type:
Ser/Thr Protein Kinase
Mol. Mass.:
41392.76
Organism:
Homo sapiens (Human)
Description:
P28482
Residue:
360
  
Inhibitor
Name:
BDBM50089077
Synonyms:
CHEMBL3577641
Type:
Small organic molecule
Emp. Form.:
C32H27N3O5
Mol. Mass.:
533.5739
SMILES:
COc1ccc(cc1)N1C(=O)\C(=C\c2ccc(OCC(=O)Nc3cccc(OC)c3)cc2)N=C1c1ccccc1
: