Target
Hexokinase-4
Ligand
BDBM50089135
Substrate
Meas. Tech.
ChEMBL_1495696 (CHEMBL3578684)
EC50
6.0±n/a nM
Citation
 Park, KLee, BMHyun, KHHan, TLee, DHChoi, HH Design and Synthesis of Acetylenyl Benzamide Derivatives as Novel Glucokinase Activators for the Treatment of T2DM. ACS Med Chem Lett 6:296-301 (2015)  
Target
Name:
Hexokinase-4
Synonyms:
GCK Glucokinase (GK) HK IV HXK4_HUMAN Hexokinase-D
Type:
Enzyme
Mol. Mass.:
52175.81
Organism:
Homo sapiens (Human)
Description:
P35557
Residue:
465
  
Inhibitor
Name:
BDBM50089135
Synonyms:
CHEMBL3577729
Type:
Small organic molecule
Emp. Form.:
C30H37N5O3
Mol. Mass.:
515.6465
SMILES:
COC[C@H](C)Oc1cc(cc(c1)C(=O)Nc1ccn(C)n1)C#Cc1cccc(NCCN2CCCCC2)c1
: