Target
Transient receptor potential cation channel subfamily M member 8
Ligand
BDBM50089248
Substrate
Meas. Tech.
ChEMBL_1496190 (CHEMBL3579074)
IC50
94±n/a nM
Citation
 Andrews, MDAf Forselles, KBeaumont, KGalan, SRGlossop, PAGrenie, MJessiman, AKenyon, ASLunn, GMaw, GOwen, RMPryde, DCRoberts, DTran, TD Discovery of a Selective TRPM8 Antagonist with Clinical Efficacy in Cold-Related Pain. ACS Med Chem Lett 6:419-24 (2015)  
Target
Name:
Transient receptor potential cation channel subfamily M member 8
Synonyms:
LTRPC6 TRPM8_HUMAN Transient receptor potential M8 protein (TRPM8) Transient receptor potential cation channel subfamily M member 8 (TRPM8)
Type:
Enzyme
Mol. Mass.:
127693.26
Organism:
Homo sapiens (Human)
Description:
Q7Z2W7
Residue:
1104
  
Inhibitor
Name:
BDBM50089248
Synonyms:
CHEMBL3577881
Type:
Small organic molecule
Emp. Form.:
C24H20FN3O3
Mol. Mass.:
417.4323
SMILES:
C[C@@H](N(Cc1cccc(c1)C(O)=O)C(=O)c1cc2ccccn2n1)c1ccc(F)cc1
: