Target
Melanocortin receptor 4
Ligand
BDBM50089402
Substrate
Meas. Tech.
ChEMBL_1496671 (CHEMBL3579242)
Ki
100±n/a nM
Citation
 Ericson, MDWilczynski, ASorensen, NBXiang, ZHaskell-Luevano, C Discovery of aß-Hairpin Octapeptide, c[Pro-Arg-Phe-Phe-Dap-Ala-Phe-DPro], Mimetic of Agouti-Related Protein(87-132) [AGRP(87-132)] with Equipotent Mouse Melanocortin-4 Receptor (mMC4R) Antagonist Pharmacology. J Med Chem 58:4638-47 (2015)  
Target
Name:
Melanocortin receptor 4
Synonyms:
MC4-R Mc4r
Type:
PROTEIN
Mol. Mass.:
36964.43
Organism:
Mus musculus
Description:
ChEMBL_1498850
Residue:
332
  
Inhibitor
Name:
BDBM50089402
Synonyms:
CHEMBL3577985
Type:
Small organic molecule
Emp. Form.:
C51H66N12O9
Mol. Mass.:
991.1447
SMILES:
[H][C@@]12CCCN1C(=O)[C@@]1([H])CCCN1C(=O)[C@H](Cc1ccccc1)NC(=O)[C@H](C)NC(=O)[C@H](CC(N)=O)NC(=O)[C@H](Cc1ccccc1)NC(=O)C(CCc1ccccc1)NC(=O)[C@H](CCCNC(N)=N)NC2=O
: