Target
Neuropeptide Y receptor type 2
Ligand
BDBM50089436
Substrate
Meas. Tech.
ChEMBL_1496675 (CHEMBL3579246)
EC50
1.7±n/a nM
Citation
 Kilian, TMKlöting, NBergmann, REls-Heindl, SBabilon, SClément-Ziza, MZhang, YBeck-Sickinger, AGChollet, C Rational design of dual peptides targeting ghrelin and Y2 receptors to regulate food intake and body weight. J Med Chem 58:4180-93 (2015)  
Target
Name:
Neuropeptide Y receptor type 2
Synonyms:
NPY-Y2 NPY2-R NPY2R_HUMAN Y2 receptor | neuropeptide Y receptor Y2
Type:
Enzyme Catalytic Domain
Mol. Mass.:
42734.65
Organism:
Homo sapiens (Human)
Description:
NPY-Y2 NPY2R HUMAN::P49146
Residue:
381
  
Inhibitor
Name:
BDBM50089436
Synonyms:
CHEMBL3578015
Type:
Small organic molecule
Emp. Form.:
C140H209N39O28
Mol. Mass.:
2886.402
SMILES:
CC(C)C[C@H](NC(=O)[C@H](CCCCNC(=O)CCNC(=O)[C@H](CCC(N)=O)NC(=O)[C@H](CC(C)C)NC(=O)[C@@H](Cc1c[nH]c2ccccc12)NC(=O)[C@H](Cc1ccccc1)NC(=O)[C@@H](Cc1cccc2ccccc12)NC(=O)[C@@H](N)CCCCN)NC(C)=O)C(=O)N[C@@H](CCCNC(N)=N)C(=O)N[C@@H](Cc1cnc[nH]1)C(=O)N[C@@H](Cc1ccc(O)cc1)C(=O)N[C@@H](CC(C)C)C(=O)N[C@@H](CC(N)=O)C(=O)N[C@@H](CC(C)C)C(=O)N[C@@H](CC(C)C)C(=O)N[C@@H]([C@@H](C)O)C(=O)N[C@@H](CCCNC(N)=N)C(=O)N[C@@H](CCC(N)=O)C(=O)N[C@@H](CCCNC(N)=N)C(=O)N[C@@H](Cc1ccc(O)cc1)C(N)=O
: