Target
Glutamate carboxypeptidase 2
Ligand
BDBM50089453
Substrate
Meas. Tech.
ChEMBL_1497035 (CHEMBL3579845)
Ki
0.110000±n/a nM
Citation
 Tykvart, JSchimer, JJancarík, ABarinková, JNavrátil, VStarková, J?rámková, KKonvalinka, JMajer, P?ácha, P Design of highly potent urea-based, exosite-binding inhibitors selective for glutamate carboxypeptidase II. J Med Chem 58:4357-63 (2015)  
Target
Name:
Glutamate carboxypeptidase 2
Synonyms:
FGCP FOLH1 Folate hydrolase 1 Glutamate carboxypeptidase 2 Membrane glutamate carboxypeptidase NAALAD1 PSM Prostate-specific membrane antigen mGCP
Type:
PROTEIN
Mol. Mass.:
84333.66
Organism:
Homo sapiens (Human)
Description:
ChEMBL_1497035
Residue:
750
  
Inhibitor
Name:
BDBM50089453
Synonyms:
CHEMBL3578200
Type:
Small organic molecule
Emp. Form.:
C76H116BrN11O23S
Mol. Mass.:
1663.763
SMILES:
[H][C@]12CS[C@@H](CCCCC(=O)NCCOCCOCCOCCOCCOCCOCCOCCOCCOCCOCCOCCOCCC(=O)N3CCN(CC3)c3ccc(cc3)N3CCN(CC3)c3ccc(cn3)C(=O)N(CCCC[C@H](NC(=O)N[C@@H](CCC(O)=O)C(O)=O)C(O)=O)Cc3ccc(Br)cc3)[C@@]1([H])NC(=O)N2
: