Target
Mineralocorticoid receptor
Ligand
BDBM50089630
Substrate
Meas. Tech.
ChEMBL_1497285 (CHEMBL3578998)
IC50
1200±n/a nM
Citation
 Yang, CBalsells, JChu, HDCox, JMCrespo, AMa, XContino, LBrown, PGao, SZamlynny, BWiltsie, JClemas, JLisnock, JGibson, JZhou, GGarcia-Calvo, MBateman, TJTong, VXu, LCrook, MSinclair, PShen, HC Discovery of benzimidazole oxazolidinediones as novel and selective nonsteroidal mineralocorticoid receptor antagonists. ACS Med Chem Lett 6:461-5 (2015)  
Target
Name:
Mineralocorticoid receptor
Synonyms:
MCR MLR NR3C2 | Nuclear receptor subfamily 3 group C member 2
Type:
Enzyme
Mol. Mass.:
107076.42
Organism:
Homo sapiens (Human)
Description:
P08235
Residue:
984
  
Inhibitor
Name:
BDBM50089630
Synonyms:
CHEMBL3578277
Type:
Small organic molecule
Emp. Form.:
C27H23FN4O4
Mol. Mass.:
486.4943
SMILES:
C[C@@H](N1C(=O)O[C@@](Cc2ccccc2)(C1=O)c1nc2cc(NC(C)=O)ccc2[nH]1)c1ccc(F)cc1
: