Target
Prostaglandin G/H synthase 1
Ligand
BDBM50089646
Substrate
Meas. Tech.
ChEMBL_1495498 (CHEMBL3579882)
IC50
90900±n/a nM
Citation
 Singh, PPrasher, PDhillon, PBhatti, R Indole based peptidomimetics as anti-inflammatory and anti-hyperalgesic agents: Dual inhibition of 5-LOX and COX-2 enzymes. Eur J Med Chem 97:104-23 (2015)  
Target
Name:
Prostaglandin G/H synthase 1
Synonyms:
COX1 Cyclooxygenase-1 (COX-1) PTGS1 | Prostaglandin G/H synthase (cyclooxygenase)
Type:
Protein
Mol. Mass.:
68868.60
Organism:
Ovis aries (Sheep)
Description:
Residue:
600
  
Inhibitor
Name:
BDBM50089646
Synonyms:
CHEMBL3576981
Type:
Small organic molecule
Emp. Form.:
C31H28N4O7S
Mol. Mass.:
600.642
SMILES:
COC(=O)[C@H](Cc1c[nH]c2ccccc12)NC(=O)CNC(=O)C(=O)c1cn(c2ccccc12)S(=O)(=O)c1ccc(C)cc1
: