Target
Prostaglandin G/H synthase 2
Ligand
BDBM50089651
Substrate
Meas. Tech.
ChEMBL_1495504 (CHEMBL3579888)
Ki
109±n/a nM
Citation
 Singh, PPrasher, PDhillon, PBhatti, R Indole based peptidomimetics as anti-inflammatory and anti-hyperalgesic agents: Dual inhibition of 5-LOX and COX-2 enzymes. Eur J Med Chem 97:104-23 (2015)  
Target
Name:
Prostaglandin G/H synthase 2
Synonyms:
COX2 Cyclooxygenase 2 (COX-2) Cyclooxygenase-2 (COX-2 AA) Cyclooxygenase-2 (COX-2) PGH2_HUMAN PHS II Prostaglandin E synthase/G/H synthase 2 Prostaglandin-endoperoxide synthase 2
Type:
Enzyme
Mol. Mass.:
69003.89
Organism:
Homo sapiens (Human)
Description:
Recombinant Cox-2 provided by Cayman (Cayman Chemical Co.,Ann Arbor, MI).
Residue:
604
  
Inhibitor
Name:
BDBM50089651
Synonyms:
CHEMBL3576979
Type:
Small organic molecule
Emp. Form.:
C30H26N4O7S
Mol. Mass.:
586.615
SMILES:
Cc1ccc(cc1)S(=O)(=O)n1cc(C(=O)C(=O)N[C@@H](Cc2c[nH]c3ccccc23)C(=O)NCC(O)=O)c2ccccc12
: