Target
Prostaglandin G/H synthase 2
Ligand
BDBM50089645
Substrate
Meas. Tech.
ChEMBL_1495499 (CHEMBL3579883)
IC50
6610±n/a nM
Citation
 Singh, PPrasher, PDhillon, PBhatti, R Indole based peptidomimetics as anti-inflammatory and anti-hyperalgesic agents: Dual inhibition of 5-LOX and COX-2 enzymes. Eur J Med Chem 97:104-23 (2015)  
Target
Name:
Prostaglandin G/H synthase 2
Synonyms:
COX2 Cyclooxygenase 2 (COX-2) Cyclooxygenase-2 (COX-2 AA) Cyclooxygenase-2 (COX-2) PGH2_HUMAN PHS II Prostaglandin E synthase/G/H synthase 2 Prostaglandin-endoperoxide synthase 2
Type:
Enzyme
Mol. Mass.:
69003.89
Organism:
Homo sapiens (Human)
Description:
Recombinant Cox-2 provided by Cayman (Cayman Chemical Co.,Ann Arbor, MI).
Residue:
604
  
Inhibitor
Name:
BDBM50089645
Synonyms:
CHEMBL3576987
Type:
Small organic molecule
Emp. Form.:
C31H28N4O7S
Mol. Mass.:
600.642
SMILES:
COC(=O)[C@@H](Cc1c[nH]c2ccccc12)NC(=O)CNC(=O)C(=O)c1cn(c2ccccc12)S(=O)(=O)c1ccc(C)cc1
: