Target
Coagulation factor X
Ligand
BDBM50089687
Substrate
Meas. Tech.
ChEMBL_1496380 (CHEMBL3580146)
IC50
38000±n/a nM
Citation
 Halland, NBrönstrup, MCzech, JCzechtizky, WEvers, AFollmann, MKohlmann, MSchiell, MKurz, MSchreuder, HAKallus, C Novel Small Molecule Inhibitors of Activated Thrombin Activatable Fibrinolysis Inhibitor (TAFIa) from Natural Product Anabaenopeptin. J Med Chem 58:4839-44 (2015)  
Target
Name:
Coagulation factor X
Synonyms:
Activated coagulation factor X (FXa) Coagulation factor X precursor F10 Factor X heavy chain Factor Xa Stuart-Prower factor
Type:
Enzyme
Mol. Mass.:
54726.60
Organism:
Homo sapiens (Human)
Description:
Residue:
488
  
Inhibitor
Name:
BDBM50089687
Synonyms:
Anabaenopeptin F
Type:
Small organic molecule
Emp. Form.:
C42H62N10O9
Mol. Mass.:
851.0033
SMILES:
[H][C@]1(NC(=O)[C@@H](CCCCNC(=O)[C@H](Cc2ccccc2)NC(=O)[C@H](C)N(C)C(=O)[C@H](CCc2ccc(O)cc2)NC1=O)NC(=O)N[C@@H](CCCNC(N)=N)C(O)=O)[C@@H](C)CC
: