Target
Carboxypeptidase A1
Ligand
BDBM50089686
Substrate
Meas. Tech.
ChEMBL_1496378 (CHEMBL3580144)
IC50
>100000±n/a nM
Citation
 Halland, NBrönstrup, MCzech, JCzechtizky, WEvers, AFollmann, MKohlmann, MSchiell, MKurz, MSchreuder, HAKallus, C Novel Small Molecule Inhibitors of Activated Thrombin Activatable Fibrinolysis Inhibitor (TAFIa) from Natural Product Anabaenopeptin. J Med Chem 58:4839-44 (2015)  
Target
Name:
Carboxypeptidase A1
Synonyms:
CBPA1_HUMAN CPA1
Type:
PROTEIN
Mol. Mass.:
47132.61
Organism:
Homo sapiens (Human)
Description:
ChEMBL_1496378
Residue:
419
  
Inhibitor
Name:
BDBM50089686
Synonyms:
CHEMBL3577334
Type:
Small organic molecule
Emp. Form.:
C41H60N8O9
Mol. Mass.:
808.9633
SMILES:
CC(C)[C@@H]1NC(=O)[C@@H](CCCCNC(=O)[C@H](Cc2ccccc2)NC(=O)[C@H](C)N(C)C(=O)[C@H](CCc2ccc(O)cc2)NC1=O)NC(=O)N[C@@H](CCCCN)C(O)=O
: