Target
Chitinase B
Ligand
BDBM50089857
Substrate
Meas. Tech.
ChEMBL_1496848 (CHEMBL3580202)
IC50
33±n/a nM
Citation
 Sugawara, AMaita, NGouda, HYamamoto, THirose, TKimura, SSaito, YNakano, HKasai, TNakano, HShiomi, KHirono, SWatanabe, TTaniguchi, HOmura, SSunazuka, T Creation of Customized Bioactivity within a 14-Membered Macrolide Scaffold: Design, Synthesis, and Biological Evaluation Using a Family-18 Chitinase. J Med Chem 58:4984-97 (2015)  
Target
Name:
Chitinase B
Synonyms:
CHIB_SERMA | chiB
Type:
Enzyme
Mol. Mass.:
55462.70
Organism:
Serratia marcescens
Description:
P11797
Residue:
499
  
Inhibitor
Name:
BDBM50089857
Synonyms:
Argadin
Type:
Small organic molecule
Emp. Form.:
C29H42N10O9
Mol. Mass.:
674.7054
SMILES:
[H][C@@]12C[C@@H](O)N([C@@H](Cc3c[nH]cn3)C(=O)N[C@@H](CCCC(O)=O)C(=O)N[C@@H](CCCNC(=N)NC(C)=O)C(=O)N3CCC[C@]3([H])C(=O)N1)C2=O
: