Target
Growth hormone secretagogue receptor type 1
Ligand
BDBM50089883
Substrate
Meas. Tech.
ChEMBL_1499282 (CHEMBL3583164)
IC50
65±n/a nM
Citation
 Blayo, ALMaingot, MAicher, BM'Kadmi, CSchmidt, PMüller, GTeifel, MGünther, EGagne, DDenoyelle, SMartinez, JFehrentz, JA New trisubstituted 1,2,4-triazoles as ghrelin receptor antagonists. Bioorg Med Chem Lett 25:20-4 (2014)  
Target
Name:
Growth hormone secretagogue receptor type 1
Synonyms:
GH-releasing peptide receptor GHS-R GHSR_HUMAN Ghrelin receptor | Ghrelin receptor 1a (GHS-R1a)
Type:
Receptor
Mol. Mass.:
41334.57
Organism:
Homo sapiens (Human)
Description:
Receptor binding studies use plasma membranes from LLC PK-1 cells transiently transfected with hGHSR1a.
Residue:
366
  
Inhibitor
Name:
BDBM50089883
Synonyms:
CHEMBL3581046
Type:
Small organic molecule
Emp. Form.:
C38H39N7O2
Mol. Mass.:
625.762
SMILES:
COc1ccc(Cn2c(CCc3ccccc3)nnc2[C@@H](Cc2c[nH]c3ccccc23)NC(=O)c2ccc(cn2)N2CCCC2)cc1
: