Target
L-lactate dehydrogenase A chain
Ligand
BDBM50089953
Substrate
Meas. Tech.
ChEMBL_1499429 (CHEMBL3583864)
IC50
230±n/a nM
Citation
 Labadie, SDragovich, PSChen, JFauber, BPBoggs, JCorson, LBDing, CZEigenbrot, CGe, HHo, QLai, KWMa, SMalek, SPeterson, DPurkey, HERobarge, KSalphati, LSideris, SUltsch, MVanderPorten, EWei, BXu, QYen, IYue, QZhang, HZhang, XZhou, A Optimization of 5-(2,6-dichlorophenyl)-3-hydroxy-2-mercaptocyclohex-2-enones as potent inhibitors of human lactate dehydrogenase. Bioorg Med Chem Lett 25:75-82 (2015)  
Target
Name:
L-lactate dehydrogenase A chain
Synonyms:
Cell proliferation-inducing gene 19 protein L-lactate dehydrogenase A Chain LDH-A LDHA Lactate dehydrogenase A (LDHA) | Renal carcinoma antigen NY-REN-59
Type:
Protein
Mol. Mass.:
36694.85
Organism:
Homo sapiens (Human)
Description:
P00338::PDB Code: 4ajp
Residue:
332
  
Inhibitor
Name:
BDBM50089953
Synonyms:
CHEMBL3581175
Type:
Small organic molecule
Emp. Form.:
C25H25Cl3N2O2S
Mol. Mass.:
523.902
SMILES:
OC1=C(Sc2ccccc2Cl)C(=O)CC(C1)c1c(Cl)ccc(N2CCN(CC2)C2CC2)c1Cl
: