Target
Cannabinoid receptor 1
Ligand
BDBM50089956
Substrate
Meas. Tech.
ChEMBL_1499463 (CHEMBL3583996)
EC50
1396±n/a nM
Citation
 Harnett, JJDolo, CViossat, IAuger, FFerrandis, EBigg, DAuguet, MAuvin, SChabrier, PE Novel azoles as potent and selective cannabinoid CB2 receptor agonists. Bioorg Med Chem Lett 25:88-91 (2015)  
Target
Name:
Cannabinoid receptor 1
Synonyms:
CANN6 CB-R CNR CNR1_HUMAN Cannabinoid receptor Cannabinoid receptor 1 (brain)
Type:
G Protein-Coupled Receptor (GPCR)
Mol. Mass.:
52868.96
Organism:
Homo sapiens (Human)
Description:
P21554
Residue:
472
  
Inhibitor
Name:
BDBM50089956
Synonyms:
CHEMBL3581228
Type:
Small organic molecule
Emp. Form.:
C24H36N2O3
Mol. Mass.:
400.5542
SMILES:
CN(C)C1(CCOCC1)c1nc(co1)-c1cc(c(O)c(c1)C(C)(C)C)C(C)(C)C
: