Target
Alpha-1,6-mannosyl-glycoprotein 2-beta-N-acetylglucosaminyltransferase
Ligand
BDBM50090656
Substrate
Meas. Tech.
ChEMBL_1498282 (CHEMBL3583803)
IC50
3.7±n/a nM
Citation
 Sato, KTakahagi, HYoshikawa, TMorimoto, STakai, THidaka, KKamaura, MKubo, OAdachi, RIshii, TMaki, TMochida, TTakekawa, SNakakariya, MAmano, NKitazaki, T Discovery of a Novel Series of N-Phenylindoline-5-sulfonamide Derivatives as Potent, Selective, and Orally Bioavailable Acyl CoA:Monoacylglycerol Acyltransferase-2 Inhibitors. J Med Chem 58:3892-909 (2015)  
Target
Name:
Alpha-1,6-mannosyl-glycoprotein 2-beta-N-acetylglucosaminyltransferase
Synonyms:
2.4.1.143 GNT-II MGAT2 Mannoside acetylglucosaminyltransferase 2 Monoacylglycerol acyltransferase type 2 (h-MGAT2) h-MGAT2 (human monoacylglycerol acyltransferase type 2)
Type:
Mol. Mass.:
51567.80
Organism:
Homo sapiens (Human)
Description:
Q10469
Residue:
447
  
Inhibitor
Name:
BDBM50090656
Synonyms:
CHEMBL3581724
Type:
Small organic molecule
Emp. Form.:
C25H25F2N3O3S
Mol. Mass.:
485.546
SMILES:
CC(=O)Nc1cc(cc2CCN(CCCc3ccccc3)c12)S(=O)(=O)Nc1ccc(F)cc1F
: