Target
Glycogen synthase kinase-3 beta
Ligand
BDBM50090907
Substrate
Meas. Tech.
ChEMBL_1498490 (CHEMBL3584608)
IC50
6800±n/a nM
Citation
 Ohishi, KToume, KArai, MAKoyano, TKowithayakorn, TMizoguchi, TItoh, MIshibashi, M 9-Hydroxycanthin-6-one, aß-Carboline Alkaloid from Eurycoma longifolia, Is the First Wnt Signal Inhibitor through Activation of Glycogen Synthase Kinase 3ß without Depending on Casein Kinase 1a. J Nat Prod 78:1139-46 (2015)  
Target
Name:
Glycogen synthase kinase-3 beta
Synonyms:
GSK-3 beta GSK3B Glycogen synthase kinase 3 beta (GSK3B) Glycogen synthase kinase-3 beta (GSK-3B) Glycogen synthase kinase-3 beta (GSK3B) Glycogen synthase kinase-3beta (GSK3B) | Serine/threonine-protein kinase GSK3B
Type:
Enzyme
Mol. Mass.:
46756.38
Organism:
Homo sapiens (Human)
Description:
P49841
Residue:
420
  
Inhibitor
Name:
BDBM50090907
Synonyms:
CHEBI:66041 | CHEMBL444160
Type:
Small organic molecule
Emp. Form.:
C14H8N2O2
Mol. Mass.:
236.2255
SMILES:
Oc1ccc2c3ccnc4ccc(=O)n(c2c1)c34
: