Target
Hepatocyte growth factor receptor
Ligand
BDBM50317323
Substrate
Meas. Tech.
ChEMBL_1499716 (CHEMBL3585032)
IC50
6870±n/a nM
Citation
 Raeppel, SLRaeppel, FTherrien, E Design and synthesis of close analogs of LCRF-0004, a potent and selective RON receptor tyrosine kinase inhibitor. Bioorg Med Chem Lett 25:2527-31 (2015)  
Target
Name:
Hepatocyte growth factor receptor
Synonyms:
Hepatocyte growth factor receptor Hepatocyte growth factor receptor (c-MET) MET Met proto-oncogene (hepatocyte growth factor receptor) Tyrosine-protein kinase Met (c-Met) c-Met kinase
Type:
Protein
Mol. Mass.:
155559.73
Organism:
Homo sapiens (Human)
Description:
P08581
Residue:
1390
  
Inhibitor
Name:
BDBM50317323
Synonyms:
CHEMBL1094718 | N-(3-fluoro-4-(2-(1-methyl-1H-imidazol-4-yl)thieno[3,2-b]pyridin-7-yloxy)phenyl)-1-phenyl-5-(trifluoromethyl)-1H-pyrazole-4-carboxamide
Type:
Small organic molecule
Emp. Form.:
C28H18F4N6O2S
Mol. Mass.:
578.54
SMILES:
Cn1cnc(c1)-c1cc2nccc(Oc3ccc(NC(=O)c4cnn(c4C(F)(F)F)-c4ccccc4)cc3F)c2s1
: