Target
Progesterone receptor
Ligand
BDBM50091048
Substrate
Meas. Tech.
ChEMBL_1499885 (CHEMBL3583217)
Ki
22±n/a nM
Citation
 Eda, MKuroda, TKaneko, SAoki, YYamashita, MOkumura, CIkeda, YOhbora, TSakaue, MKoyama, NAritomo, K Synthesis and Biological Evaluation of Cyclopentaquinoline Derivatives as Nonsteroidal Glucocorticoid Receptor Antagonists. J Med Chem 58:4918-26 (2015)  
Target
Name:
Progesterone receptor
Synonyms:
NR3C3 PGR PRGR_HUMAN | progesterone
Type:
Protein
Mol. Mass.:
98979.52
Organism:
Homo sapiens (Human)
Description:
P06401
Residue:
933
  
Inhibitor
Name:
BDBM50091048
Synonyms:
CHEMBL3582109
Type:
Small organic molecule
Emp. Form.:
C18H22N2O2
Mol. Mass.:
298.3795
SMILES:
Cc1noc(C)c1-c1ccc2NC(C)(C)C(=O)C(C)(C)c2c1
: