Target
Glucocorticoid receptor
Ligand
BDBM50091048
Substrate
Meas. Tech.
ChEMBL_1499884 (CHEMBL3583216)
Ki
16±n/a nM
Citation
 Eda, MKuroda, TKaneko, SAoki, YYamashita, MOkumura, CIkeda, YOhbora, TSakaue, MKoyama, NAritomo, K Synthesis and Biological Evaluation of Cyclopentaquinoline Derivatives as Nonsteroidal Glucocorticoid Receptor Antagonists. J Med Chem 58:4918-26 (2015)  
Target
Name:
Glucocorticoid receptor
Synonyms:
GCR_HUMAN GRL Glucocorticoid receptor (GRFP) Nuclear receptor subfamily 3 group C member 1
Type:
Enzyme
Mol. Mass.:
85656.87
Organism:
Homo sapiens (Human)
Description:
P04150
Residue:
777
  
Inhibitor
Name:
BDBM50091048
Synonyms:
CHEMBL3582109
Type:
Small organic molecule
Emp. Form.:
C18H22N2O2
Mol. Mass.:
298.3795
SMILES:
Cc1noc(C)c1-c1ccc2NC(C)(C)C(=O)C(C)(C)c2c1
: