Target
ATP-dependent translocase ABCB1
Ligand
BDBM50091083
Substrate
Meas. Tech.
ChEMBL_1500054 (CHEMBL3584050)
IC50
21±n/a nM
Citation
 Wong, ILWang, BCYuan, JDuan, LXLiu, ZLiu, TLi, XMHu, XZhang, XYJiang, TWan, SBChow, LM Potent and Nontoxic Chemosensitizer of P-Glycoprotein-Mediated Multidrug Resistance in Cancer: Synthesis and Evaluation of Methylated Epigallocatechin, Gallocatechin, and Dihydromyricetin Derivatives. J Med Chem 58:4529-49 (2015)  
Target
Name:
ATP-dependent translocase ABCB1
Synonyms:
ABCB1 MDR1_HUMAN Multidrug resistance protein 1 P-glycoprotein (P-gp) PGY1
Type:
Protein
Mol. Mass.:
141503.50
Organism:
Homo sapiens (Human)
Description:
P08183
Residue:
1280
  
Inhibitor
Name:
BDBM50091083
Synonyms:
CHEMBL1631996
Type:
Small organic molecule
Emp. Form.:
C30H34O11
Mol. Mass.:
570.5844
SMILES:
COc1cc(OC)c2C[C@@H](OC(=O)c3cc(OC)c(OC)c(OC)c3)[C@H](Oc2c1)c1cc(OC)c(OC)c(OC)c1
: