Target
Cytochrome P450 3A4
Ligand
BDBM50091323
Substrate
Meas. Tech.
ChEMBL_1497735 (CHEMBL3582741)
IC50
4780±n/a nM
Citation
 Ai, YHu, YKang, FLai, YJia, YHuang, ZPeng, SJi, HTian, JZhang, Y Synthesis and Biological Evaluation of Novel Olean-28,13ß-lactams as Potential Antiprostate Cancer Agents. J Med Chem 58:4506-20 (2015)  
Target
Name:
Cytochrome P450 3A4
Synonyms:
Albendazole monooxygenase CP3A4_HUMAN CYP3A4 CYPIIIA4 Cytochrome P450 3A4 (CYP3A4) Nifedipine oxidase Taurochenodeoxycholate 6-alpha-hydroxylase
Type:
Enzyme
Mol. Mass.:
57349.57
Organism:
Homo sapiens (Human)
Description:
Residue:
503
  
Inhibitor
Name:
BDBM50091323
Synonyms:
CHEMBL3582243
Type:
Small organic molecule
Emp. Form.:
C32H43NO3
Mol. Mass.:
489.6887
SMILES:
[H][C@@]12CC(C)(C)CC[C@@]1(CC[C@]1(C)[C@]2([H])C(=O)C=C2[C@@]3(C)C=C(C#N)C(=O)C(C)(C)[C@]3([H])CC[C@@]12C)C(C)=O
: