Target
Programmed cell death 1 ligand 1
Ligand
BDBM50091332
Substrate
Meas. Tech.
ChEMBL_1497759 (CHEMBL3583018)
IC50
6±n/a nM
Citation
 Abdel-Magid, AF Inhibitors of the PD-1/PD-L1 Pathway Can Mobilize the Immune System: An Innovative Potential Therapy for Cancer and Chronic Infections. ACS Med Chem Lett 6:489-90 (2015)  
Target
Name:
Programmed cell death 1 ligand 1
Synonyms:
B7 homolog 1 B7H1 CD274 PD-L1 PDCD1 ligand 1 PDCD1LG1 Programmed cell death 1 ligand 1 | Programmed death ligand 1
Type:
PROTEIN
Mol. Mass.:
33278.49
Organism:
Homo sapiens (Human)
Description:
ChEMBL_109807
Residue:
290
  
Inhibitor
Name:
BDBM50091332
Synonyms:
CHEMBL3582254 | US9872852, Example 79
Type:
Small organic molecule
Emp. Form.:
C24H24ClNO3
Mol. Mass.:
409.905
SMILES:
C[C@@H](NCc1ccc(OCc2cccc(c2C)-c2ccccc2)c(Cl)c1)C(O)=O
: