Target
Tyrosine-protein kinase receptor UFO
Ligand
BDBM50091364
Substrate
Meas. Tech.
ChEMBL_1497946 (CHEMBL3583345)
IC50
>10000±n/a nM
Citation
 Li, CAi, JZhang, DPeng, XChen, XGao, ZSu, YZhu, WJi, YChen, XGeng, MLiu, H Design, Synthesis, and Biological Evaluation of Novel Imidazo[1,2-a]pyridine Derivatives as Potent c-Met Inhibitors. ACS Med Chem Lett 6:507-12 (2015)  
Target
Name:
Tyrosine-protein kinase receptor UFO
Synonyms:
AXL TEL/AXL UFO | UFO_HUMAN
Type:
Enzyme
Mol. Mass.:
98316.97
Organism:
Homo sapiens (Human)
Description:
P30530
Residue:
894
  
Inhibitor
Name:
BDBM50091364
Synonyms:
CHEMBL3582294
Type:
Small organic molecule
Emp. Form.:
C25H18F2N4O
Mol. Mass.:
428.4334
SMILES:
CNC(=O)c1ccc(cc1F)-c1cc(F)c2ncc(Cc3ccc4ncccc4c3)n2c1
: