Target
Hepatocyte growth factor receptor
Ligand
BDBM50302905
Substrate
Meas. Tech.
ChEMBL_1497944 (CHEMBL3583343)
IC50
6.0±n/a nM
Citation
 Li, CAi, JZhang, DPeng, XChen, XGao, ZSu, YZhu, WJi, YChen, XGeng, MLiu, H Design, Synthesis, and Biological Evaluation of Novel Imidazo[1,2-a]pyridine Derivatives as Potent c-Met Inhibitors. ACS Med Chem Lett 6:507-12 (2015)  
Target
Name:
Hepatocyte growth factor receptor
Synonyms:
Hepatocyte growth factor receptor Hepatocyte growth factor receptor (c-MET) MET Met proto-oncogene (hepatocyte growth factor receptor) Tyrosine-protein kinase Met (c-Met) c-Met kinase
Type:
Protein
Mol. Mass.:
155559.73
Organism:
Homo sapiens (Human)
Description:
P08581
Residue:
1390
  
Inhibitor
Name:
BDBM50302905
Synonyms:
7-methoxy-N-((6-(3-methylisothiazol-5-yl)-[1,2,4]triazolo[4,3-b]pyridazin-3-yl)methyl)-1,5-naphthyridin-4-amine US9066954, 4
Type:
Small organic molecule
Emp. Form.:
C19H16N8OS
Mol. Mass.:
404.448
SMILES:
COc1cnc2c(NCc3nnc4ccc(nn34)-c3cc(C)ns3)ccnc2c1
: