Target
Phosphatidylinositol 4,5-bisphosphate 3-kinase catalytic subunit gamma isoform
Ligand
BDBM50091690
Substrate
Meas. Tech.
ChEMBL_1498380 (CHEMBL3584209)
IC50
52±n/a nM
Citation
 Yang, HMedeiros, PFRaha, KElkins, PLind, KELehr, RAdams, NDBurgess, JLSchmidt, SJKnight, SDAuger, KRSchaber, MDFranklin, GJDing, YDeLorey, JLCentrella, PAMataruse, SSkinner, SRClark, MACuozzo, JWEvindar, G Discovery of a Potent Class of PI3Ka Inhibitors with Unique Binding Mode via Encoded Library Technology (ELT). ACS Med Chem Lett 6:531-6 (2015)  
Target
Name:
Phosphatidylinositol 4,5-bisphosphate 3-kinase catalytic subunit gamma isoform
Synonyms:
PI3-kinase p110 subunit gamma PI3Kgamma PK3CG_HUMAN Phosphatidylinositol 4,5-bisphosphate 3-kinase (PI3K) Phosphatidylinositol 4,5-bisphosphate 3-kinase catalytic subunit gamma (PI3Kgamma) Phosphatidylinositol 4,5-bisphosphate 3-kinase catalytic subunit gamma isoform (PI3K) Phosphatidylinositol-4,5-bisphosphate 3-kinase catalytic subunit gamma isoform Phosphoinositide 3-kinases gamma (PI3K gamma) p120-PI3K
Type:
Enzyme Subunit
Mol. Mass.:
126470.30
Organism:
Homo sapiens (Human)
Description:
P48736
Residue:
1102
  
Inhibitor
Name:
BDBM50091690
Synonyms:
CHEMBL3582355
Type:
Small organic molecule
Emp. Form.:
C22H21N5O3S2
Mol. Mass.:
467.564
SMILES:
COc1ccc(cn1)-c1cccc(CNc2ccc(cc2)S(=O)(=O)Nc2nnc(C)s2)c1
: